Sharedsupport / 2016-02-10-jupyter-spark.ipynbOpen in CoCalc
Examples for support purposes...
NUM_SAMPLES = 1000
import random

def sample(p):
    x, y = random(), random()
    return 1 if x*x + y*y < 1 else 0

count = sc.parallelize(xrange(0, NUM_SAMPLES)).map(sample) \
             .reduce(lambda a, b: a + b)
print "Pi is roughly %f" % (4.0 * count / NUM_SAMPLES)
--------------------------------------------------------------------------- Py4JJavaError Traceback (most recent call last) <ipython-input-3-8aaa67dfc29d> in <module>() 6 return 1 if x*x + y*y < 1 else 0 7 ----> 8 count = sc.parallelize(xrange(0, NUM_SAMPLES)).map(sample) .reduce(lambda a, b: a + b) 9 print "Pi is roughly %f" % (4.0 * count / NUM_SAMPLES) /projects/spark/spark/python/pyspark/rdd.py in reduce(self, f) 795 yield reduce(f, iterator, initial) 796 --> 797 vals = self.mapPartitions(func).collect() 798 if vals: 799 return reduce(f, vals) /projects/spark/spark/python/pyspark/rdd.py in collect(self) 769 """ 770 with SCCallSiteSync(self.context) as css: --> 771 port = self.ctx._jvm.PythonRDD.collectAndServe(self._jrdd.rdd()) 772 return list(_load_from_socket(port, self._jrdd_deserializer)) 773 /projects/spark/spark/python/lib/py4j-0.9-src.zip/py4j/java_gateway.py in __call__(self, *args) 811 answer = self.gateway_client.send_command(command) 812 return_value = get_return_value( --> 813 answer, self.gateway_client, self.target_id, self.name) 814 815 for temp_arg in temp_args: /projects/spark/spark/python/pyspark/sql/utils.py in deco(*a, **kw) 43 def deco(*a, **kw): 44 try: ---> 45 return f(*a, **kw) 46 except py4j.protocol.Py4JJavaError as e: 47 s = e.java_exception.toString() /projects/spark/spark/python/lib/py4j-0.9-src.zip/py4j/protocol.py in get_return_value(answer, gateway_client, target_id, name) 306 raise Py4JJavaError( 307 "An error occurred while calling {0}{1}{2}.\n". --> 308 format(target_id, ".", name), value) 309 else: 310 raise Py4JError( Py4JJavaError: An error occurred while calling z:org.apache.spark.api.python.PythonRDD.collectAndServe. : org.apache.spark.SparkException: Job aborted due to stage failure: Task 0 in stage 1.0 failed 1 times, most recent failure: Lost task 0.0 in stage 1.0 (TID 1, localhost): org.apache.spark.api.python.PythonException: Traceback (most recent call last): File "/projects/spark/spark/python/lib/pyspark.zip/pyspark/worker.py", line 111, in main process() File "/projects/spark/spark/python/lib/pyspark.zip/pyspark/worker.py", line 106, in process serializer.dump_stream(func(split_index, iterator), outfile) File "/projects/spark/spark/python/lib/pyspark.zip/pyspark/serializers.py", line 263, in dump_stream vs = list(itertools.islice(iterator, batch)) File "/projects/spark/spark/python/pyspark/rdd.py", line 792, in func initial = next(iterator) File "<ipython-input-3-8aaa67dfc29d>", line 5, in sample TypeError: 'module' object is not callable at org.apache.spark.api.python.PythonRunner$$anon$1.read(PythonRDD.scala:166) at org.apache.spark.api.python.PythonRunner$$anon$1.<init>(PythonRDD.scala:207) at org.apache.spark.api.python.PythonRunner.compute(PythonRDD.scala:125) at org.apache.spark.api.python.PythonRDD.compute(PythonRDD.scala:70) at org.apache.spark.rdd.RDD.computeOrReadCheckpoint(RDD.scala:306) at org.apache.spark.rdd.RDD.iterator(RDD.scala:270) at org.apache.spark.scheduler.ResultTask.runTask(ResultTask.scala:66) at org.apache.spark.scheduler.Task.run(Task.scala:89) at org.apache.spark.executor.Executor$TaskRunner.run(Executor.scala:213) at java.util.concurrent.ThreadPoolExecutor.runWorker(ThreadPoolExecutor.java:1145) at java.util.concurrent.ThreadPoolExecutor$Worker.run(ThreadPoolExecutor.java:615) at java.lang.Thread.run(Thread.java:745) Driver stacktrace: at org.apache.spark.scheduler.DAGScheduler.org$apache$spark$scheduler$DAGScheduler$$failJobAndIndependentStages(DAGScheduler.scala:1431) at org.apache.spark.scheduler.DAGScheduler$$anonfun$abortStage$1.apply(DAGScheduler.scala:1419) at org.apache.spark.scheduler.DAGScheduler$$anonfun$abortStage$1.apply(DAGScheduler.scala:1418) at scala.collection.mutable.ResizableArray$class.foreach(ResizableArray.scala:59) at scala.collection.mutable.ArrayBuffer.foreach(ArrayBuffer.scala:47) at org.apache.spark.scheduler.DAGScheduler.abortStage(DAGScheduler.scala:1418) at org.apache.spark.scheduler.DAGScheduler$$anonfun$handleTaskSetFailed$1.apply(DAGScheduler.scala:799) at org.apache.spark.scheduler.DAGScheduler$$anonfun$handleTaskSetFailed$1.apply(DAGScheduler.scala:799) at scala.Option.foreach(Option.scala:236) at org.apache.spark.scheduler.DAGScheduler.handleTaskSetFailed(DAGScheduler.scala:799) at org.apache.spark.scheduler.DAGSchedulerEventProcessLoop.doOnReceive(DAGScheduler.scala:1640) at org.apache.spark.scheduler.DAGSchedulerEventProcessLoop.onReceive(DAGScheduler.scala:1599) at org.apache.spark.scheduler.DAGSchedulerEventProcessLoop.onReceive(DAGScheduler.scala:1588) at org.apache.spark.util.EventLoop$$anon$1.run(EventLoop.scala:48) at org.apache.spark.scheduler.DAGScheduler.runJob(DAGScheduler.scala:620) at org.apache.spark.SparkContext.runJob(SparkContext.scala:1832) at org.apache.spark.SparkContext.runJob(SparkContext.scala:1845) at org.apache.spark.SparkContext.runJob(SparkContext.scala:1858) at org.apache.spark.SparkContext.runJob(SparkContext.scala:1929) at org.apache.spark.rdd.RDD$$anonfun$collect$1.apply(RDD.scala:927) at org.apache.spark.rdd.RDDOperationScope$.withScope(RDDOperationScope.scala:150) at org.apache.spark.rdd.RDDOperationScope$.withScope(RDDOperationScope.scala:111) at org.apache.spark.rdd.RDD.withScope(RDD.scala:316) at org.apache.spark.rdd.RDD.collect(RDD.scala:926) at org.apache.spark.api.python.PythonRDD$.collectAndServe(PythonRDD.scala:405) at org.apache.spark.api.python.PythonRDD.collectAndServe(PythonRDD.scala) at sun.reflect.NativeMethodAccessorImpl.invoke0(Native Method) at sun.reflect.NativeMethodAccessorImpl.invoke(NativeMethodAccessorImpl.java:57) at sun.reflect.DelegatingMethodAccessorImpl.invoke(DelegatingMethodAccessorImpl.java:43) at java.lang.reflect.Method.invoke(Method.java:606) at py4j.reflection.MethodInvoker.invoke(MethodInvoker.java:231) at py4j.reflection.ReflectionEngine.invoke(ReflectionEngine.java:381) at py4j.Gateway.invoke(Gateway.java:259) at py4j.commands.AbstractCommand.invokeMethod(AbstractCommand.java:133) at py4j.commands.CallCommand.execute(CallCommand.java:79) at py4j.GatewayConnection.run(GatewayConnection.java:209) at java.lang.Thread.run(Thread.java:745) Caused by: org.apache.spark.api.python.PythonException: Traceback (most recent call last): File "/projects/spark/spark/python/lib/pyspark.zip/pyspark/worker.py", line 111, in main process() File "/projects/spark/spark/python/lib/pyspark.zip/pyspark/worker.py", line 106, in process serializer.dump_stream(func(split_index, iterator), outfile) File "/projects/spark/spark/python/lib/pyspark.zip/pyspark/serializers.py", line 263, in dump_stream vs = list(itertools.islice(iterator, batch)) File "/projects/spark/spark/python/pyspark/rdd.py", line 792, in func initial = next(iterator) File "<ipython-input-3-8aaa67dfc29d>", line 5, in sample TypeError: 'module' object is not callable at org.apache.spark.api.python.PythonRunner$$anon$1.read(PythonRDD.scala:166) at org.apache.spark.api.python.PythonRunner$$anon$1.<init>(PythonRDD.scala:207) at org.apache.spark.api.python.PythonRunner.compute(PythonRDD.scala:125) at org.apache.spark.api.python.PythonRDD.compute(PythonRDD.scala:70) at org.apache.spark.rdd.RDD.computeOrReadCheckpoint(RDD.scala:306) at org.apache.spark.rdd.RDD.iterator(RDD.scala:270) at org.apache.spark.scheduler.ResultTask.runTask(ResultTask.scala:66) at org.apache.spark.scheduler.Task.run(Task.scala:89) at org.apache.spark.executor.Executor$TaskRunner.run(Executor.scala:213) at java.util.concurrent.ThreadPoolExecutor.runWorker(ThreadPoolExecutor.java:1145) at java.util.concurrent.ThreadPoolExecutor$Worker.run(ThreadPoolExecutor.java:615) ... 1 more